AI4Labour ontology
type: Ontology
license: https://creativecommons.org/licenses/by/4.0/
created: 2023-08-07
creator: María Poveda-Villalón
creator: Victor Rodríguez-Doncel
description: Ontology code created by Chowlk
issued: 2023-08-21
version info: 0.0.1

subject
type: ObjectProperty
comment: Recommended practice is to refer to the subject with a URI. If this is not possible or feasible, a literal value that identifies the subject may be provided. Both should preferably refer to a subject in a controlled vocabulary.

at education level
type: ObjectProperty
domain: Worker Capacity
range: Education Level Concept
comment: link from the n-ary class to the specific education level that a worker has for the specific skill/ability/knowledge

at training level
type: ObjectProperty
domain: Worker Capacity
range: Training Level Concept
comment: link from the n-ary class to the specific training level that a worker has for the specific skill/ability/knowledge

at work experience level
type: ObjectProperty
domain: Worker Capacity
range: Work Experience Level Concept
comment: link from the n-ary class to the specific work experience level that a worker has for the specific skill/ability/knowledge

has capacity
type: ObjectProperty
domain: Worker
range: Class
  union of: Ability
  union of: Knowledge
  union of: Skill
property chain axiom: has worker capacity
property chain axiom: is about worker capacity
comment: Shorcut between workers and skill/ability/knowledge without specifying the level.

has occupation requirement
type: ObjectProperty
domain: Occupation
range: Occupation Requirement
comment: link to the capacities required (skill/ability/knowledge + level) for a given occupation

has requirement
type: ObjectProperty
domain: Occupation
range: Class
  union of: Ability
  union of: Knowledge
  union of: Skill
property chain axiom: has occupation requirement
property chain axiom: is about occupation capacity
comment: Shorcut between occupations and required skill/ability/knowledge without specifying the level.

has work style
type: ObjectProperty
domain: Worker
range: Work Style
comment: link to the work styles of a given worker

has work value
type: ObjectProperty
domain: Worker
range: Work Value
comment: link to the work values of a given worker

has worker capacity
type: ObjectProperty
domain: Worker
range: Worker Capacity
comment: link to the worker capacitiies (skill/ability/knowledge + level) for a given woker

involves task
type: ObjectProperty
domain: Occupation
range: Task
comment: link between an occupation and related tasks

involves tool
type: ObjectProperty
domain: Occupation
range: Tool
comment: link between an occupation and related tools

is about occupation capacity
type: ObjectProperty
domain: Occupation Requirement
range: Class
  union of: Ability
  union of: Knowledge
  union of: Skill
comment: link from the n-ary class indicating a occupation requiment to the specific skill/ability/knowledge

is about worker capacity
type: ObjectProperty
domain: Worker Capacity
range: Class
  union of: Ability
  union of: Knowledge
  union of: Skill
comment: link from the n-ary class indicating a woker capacity to the specific skill/ability/knowledge

offered by
type: ObjectProperty
inverse of: offers
domain: Course
range: Organization
comment: link between a course and the organization offering it

offers
type: ObjectProperty
domain: Organization
range: Course
comment: link between an organization and the courses offered

provides skill
type: ObjectProperty
domain: Course
range: Skill
label: link between a course and the skills it provides with

requires education level
type: ObjectProperty
domain: Occupation Requirement
range: Education Level Concept
comment: link from the n-ary class to the specific education level that an occupation requires for the specific skill/ability/knowledge

requires training level
type: ObjectProperty
domain: Occupation Requirement
range: Training Level Concept
comment: link from the n-ary class to the specific training level that an occupation requires for the specific skill/ability/knowledge

requires work experience level
type: ObjectProperty
domain: Occupation Requirement
range: Work Experience Level Concept
comment: link from the n-ary class to the specific work expeirence level that an occupation requires for the specific skill/ability/knowledge

alt label
type: DatatypeProperty

definition
type: DatatypeProperty

pref label
type: DatatypeProperty

task id
type: DatatypeProperty
comment: task identifier

Concept
type: Class
comment: An idea or notion; a unit of thought.

Organization
type: Class
comment: Represents a collection of people organized together into a community or other social, commercial or political structure. The group has some common purpose or reason for existence which goes beyond the set of people belonging to it and can act as an Agent. Organizations are often decomposable into hierarchical structures. It is recommended that SKOS lexical labels should be used to label the Organization. In particular `skos:prefLabel` for the primary (possibly legally recognized name), `skos:altLabel` for alternative names (trading names, colloquial names) and `skos:notation` to denote a code from a code list. Alternative names: _Collective_ _Body_ _Org_ _Group_

Ability
type: Class
comment: Enduring attributes of the individual that influence performance. (Taken from https://www.onetcenter.org/content.html)

Basic Skill
type: Class
subclass of: Skill
comment: Developed capacities that facilitate learning or the more rapid acquisition of knowledge. (Taken from https://www.onetcenter.org/content.html)

Course
type: Class
comment: A series of lessons or lectures on a particular subject. (Taken from https://www.oxfordlearnersdictionaries.com)

Cross Functional Skill
type: Class
subclass of: Skill
comment: Developed capacities that facilitate performance of activities that occur across jobs. (Taken from https://www.onetcenter.org/content.html)

Education Level Concept
type: Class
subclass of: Concept
comment: Class grouping levels for prior educational experience required to perform in a job.

Knowledge
type: Class
comment: Organized sets of principles and facts applying in general domains.(Taken from https://www.onetcenter.org/content.html)

Occupation
type: Class
comment: A job or profession. (Taken from https://www.oxfordlearnersdictionaries.com)

Occupation Requirement
type: Class
comment: N-ary class defined to indicate at which level is required to have a skill, ability or knowledge for a given occupation.

Skill
type: Class
comment: Procedures to work with given knowledge. (Adpated from https://www.onetcenter.org/content.html)

Task
type: Class
comment: Occupation-Specific piece of work to be done. (Adapted from https://www.onetcenter.org/content.html and https://www.oxfordlearnersdictionaries.com)

Technology Skill
type: Class
subclass of: Skill
comment: Information technology and software skills essential to the functions of an occupational role. (Taken from https://www.onetcenter.org/content.html)

Tool
type: Class
comment: Machines, equipment, and tools essential to the performance of an occupational role. (Taken from https://www.onetcenter.org/content.html)

Topic
type: Class
comment: A subject that you talk, write or learn about. (Taken from https://www.oxfordlearnersdictionaries.com)

Training Level Concept
type: Class
subclass of: Concept
comment: Class grouping levels for prio training experience required to perform in a job.

Work Experience Level Concept
type: Class
subclass of: Concept
comment: Class grouping levels for prior work experience required to perform in a job.

Work Style
type: Class
comment: Personal characteristics that can affect how well someone performs a job. (Taken from https://www.onetcenter.org/content.html)

Work Value
type: Class
comment: Global aspects of work composed of specific needs that are important to a person's satisfaction. Occupational Reinforcer Patterns (ORPs) are based on the Theory of Work Adjustment (Dawis & Lofquist, 1984). (Taken from https://www.onetcenter.org/content.html)

Worker
type: Class
comment: A person who works, especially one who does a particular kind of work. (Taken from https://www.oxfordlearnersdictionaries.com)

Worker Capacity
type: Class
comment: N-ary class defined to indicate a skill, ability or knowledge and its level for agiven worker.